{"text_format":"1","workbook":"xlsx","n_sheets":11,"sheets":["Summary","Instructions&Contents","Economic Case","Financial Case","Project Costs","Risk Retained","Outputs","Risk Register","Land values","GDP Deflators","B3"],"not_rendered":{"charts":5,"images":4,"macros":1,"external_links":3,"defined_names":23,"comments":0,"pivot_tables":0},"unopened":[],"bounds":{"document_bytes":16777216,"sheet_cells":100000,"rows_first":2000,"rows_last":500,"rows_between":2000,"halvings":0,"cell_chars":16384,"cell_head_chars":4096},"cells_cut":0,"cells_raw":0,"read":"whole","date_system":"1900"}

{"sheet":"Summary","index":0,"n_rows":45,"n_cols":7,"rows_kept":45,"cut":false,"hidden":false,"merged":[]}
[]
[]
[null,"East Riding Enterprise Zone Retained Business Rates Grant Documentation ",null,null,null,null,"Instructions & Contents"]
[null,"Appendix - Financial and outputs tables",null,null,null,null,"Instructions & Contents"]
[]
[null,null,null,null,null,null,"Output tables"]
[null,"Project name as it appears on your main business case/expression of interest form:",null,null,null,null,"Economic Case"]
[null,"Project name as it appears on your main business case/expression of interest form:",null,null,"enter the name of your project here",null,"Financial Case"]
[]
[null,"Select your project location",null,null,null,null,"Data"]
{"$rows_left_out":36}
{"sheet":"Instructions&Contents","index":1,"n_rows":14,"n_cols":5,"rows_kept":14,"cut":false,"hidden":false,"merged":[]}
[{"$f":"+Summary!$B$8","v":"Project name as it appears on your main business case/expression of interest form:"},null,null,null,"clicking on this in any worksheet will take you to the summary tab"]
[null,"Description",null,true]
[null,null,null,false]
[null,"Comments","Completed by","Completed?","Notes"]
[null,null,null,"update when completed"]
["Output tables"]
["Economic Case","This table shows the value for money outputs based on your data",null,null,"If the project has already undertaken a fully compliant Green Book process, or is being evaluated through (eg) WebTAG or FDGiA then please provide that economic case instead"]
["Financial Case","This table shows the financial summary based on your data",null,null,"This summarises the information you put in the tabs below."]
[]
["Data",null,null,null,"Comments (enter your comments below if appropriate)"]
{"$rows_left_out":5}
{"sheet":"Economic Case","index":2,"n_rows":117,"n_cols":7,"rows_kept":117,"cut":false,"hidden":false,"merged":[[8,2,8,4],[5,0,5,4],[6,0,6,4],[108,0,108,4],[82,6,83,6],[70,2,70,4]]}
[{"$f":"+Summary!$B$8","v":"Project name as it appears on your main business case/expression of interest form:"},null,null,null,null,null,"Notes"]
["Economic Case"]
[]
[]
[]
["IF THE PROJECT HAS ALREADY UNDERTAKEN A FULLY COMPLIANT GREEN BOOK PROCESS PLEASE PROVIDE THAT REPORT INSTEAD OF COMPLETING THESE DETAILS."]
["THIS INCLUDES TRANSPORT PROJECTS EVALUATED THROUGH WEB-TAG OR ENVIRONMENT AGENCY SCHEMES."]
[]
[]
[null,null,"Undiscounted ",null,"Net Present Value"]
{"$rows_left_out":108}
{"sheet":"Financial Case","index":3,"n_rows":75,"n_cols":14,"rows_kept":75,"cut":false,"hidden":false,"merged":[]}
[{"$f":"+Summary!$B$8","v":"Project name as it appears on your main business case/expression of interest form:"}]
["financial case"]
[]
[null,null,"Total costs",null,"NPV",null,null,null,null,"Capital","Revenue"]
["Total project costs",null,null,null,null,null,null,null,null,{"$f":"+J12/SUM($J$12:$K$12)","v":{"$error":"#DIV/0!"}},{"$f":"+K12/SUM($J$12:$K$12)","v":{"$error":"#DIV/0!"}}]
[{"$f":"+'Project Costs'!A64","v":"Direct project costs"},null,{"$f":"+'Project Costs'!AG64","v":0},null,{"$f":"+'Project Costs'!AI64","v":0},null,null,null,null,{"$f":"+C6","v":0},{"$f":"+C6-J6","v":0}]
[{"$f":"+'Project Costs'!A65","v":"Ongoing maintenance costs"},null,{"$f":"+'Project Costs'!AG65","v":0},null,{"$f":"+'Project Costs'!AI65","v":0},null,null,null,null,null,{"$f":"+C7-J7","v":0}]
[{"$f":"+'Project Costs'!A66","v":"Other ongoing costs or (savings)"},null,{"$f":"+'Project Costs'!AG66","v":0},null,{"$f":"+'Project Costs'!AI66","v":0},null,null,null,null,null,0]
[{"$f":"+'Project Costs'!A67","v":"Grants to third parties"},null,{"$f":"+'Project Costs'!AG67","v":0},null,{"$f":"+'Project Costs'!AI67","v":0},null,null,null,null,{"$f":"+C9","v":0},0]
[{"$f":"+'Project Costs'!A68","v":"Project Overheads"},null,{"$f":"+'Project Costs'!AG68","v":0},null,{"$f":"+'Project Costs'!AI68","v":0},null,null,null,null,0,0]
{"$rows_left_out":66}
{"sheet":"Project Costs","index":4,"n_rows":199,"n_cols":62,"rows_kept":199,"cut":false,"hidden":false,"merged":[[56,1,60,1],[80,1,81,1],[84,1,86,1],[11,1,26,1],[28,1,32,1],[34,1,42,1],[44,1,48,1],[50,1,54,1],[7,4,8,4],[7,5,8,5],[7,0,8,0],[7,3,8,3],[7,1,8,1],[7,40,7,43],[7,44,7,58],[7,59,8,59],[7,61,8,61],[7,7,7,10],[7,11,7,31],[7,32,8,32],[7,34,8,34],[80,32,81,32],[80,34,81,34],[88,1,93,1],[95,1,99,1],[80,0,81,0],[80,3,81,3],[80,4,81,4],[80,5,81,5],[80,7,80,10],[101,1,105,1],[107,1,111,1],[113,1,117,1],[119,1,126,1],[80,11,80,31]]}
[{"$f":"+Summary!$B$8","v":"Project name as it appears on your main business case/expression of interest form:"}]
["Project Costs",null,null,null,"Independently audited cost data","current",null,0,0,null,null,2020,{"$f":"1+L2","v":2021},{"$f":"1+M2","v":2022},2023,2024,2025,2026,2027,2028,2029,2030,2031,2032,{"$f":"1+X2","v":2033},{"$f":"1+Y2","v":2034},{"$f":"1+Z2","v":2035},{"$f":"1+AA2","v":2036},{"$f":"1+AB2","v":2037},{"$f":"1+AC2","v":2038},{"$f":"1+AD2","v":2039},2040]
[null,null,null,null,"Formal service delivery contract costs","1-2 years",null,0.05,0.05,null,null,{"$f":"1+L2","v":2021},{"$f":"1+M2","v":2022},{"$f":"1+N2","v":2023},2024,2025,2026,2027,2028,2029,2030,2031,2032,2033,{"$f":"1+Y2","v":2034},2035,2036,2037,2038,2039,2040,2041]
[null,null,null,null,"Practitioner monitored costs","2-3 years",null,0.1,0.1]
[null,null,null,null,"Costs developed from ready reckoners","3-4 years",null,0.15,0.15]
[null,null,null,null,"Uncorroborated expert judgement","4/5 years",null,0.4,0.25]
[null,null,null,null,null,">5 years",null,null,0.4]
["Description of Costs","Notes",null,"Basis of calculation?","Data source","Age of data",null,{"$f":"+L9","v":"2020 / 2021"},null,null,null,"Profile (£)",null,null,null,null,null,null,null,null,null,null,null,null,null,null,null,null,null,null,null,null,"Total (£)",null,"NPV (£)",null,null,null,null,null,{"$f":"+L8","v":"Profile (£)"},null,null,null,"Profile (£m)",null,null,null,null,null,null,null,null,null,null,null,null,null,null,{"$f":"+AG8","v":"Total (£)"},null,{"$f":"+AI8","v":"NPV (£)"}]
[null,null,null,null,null,null,null,"Qtr 1","Qtr 2","Qtr 3","Qtr 4",{"$f":"+L2&\" / \"&L3","v":"2020 / 2021"},"2021 / 2022","2022 / 2023","2023 / 2024","2024 / 2025","2025 / 2026","2026 / 2027","2027 / 2028","2028 / 2029","2029 / 2030","2030 / 2031","2031 / 2032","2032 / 2033",{"$f":"+Y2&\" / \"&Y3","v":"2033 / 2034"},"2034 / 2035","2035 / 2036","2036 / 2037","2037 / 2038","2038 / 2039","2039 / 2040","2040 / 2041",null,null,null,null,null,null,null,null,"Qtr 1","Qtr 2","Qtr 3","Qtr 4",{"$f":"+L9","v":"2020 / 2021"},"2021 / 2022","2022 / 2023","2023 / 2024","2024 / 2025","2025 / 2026","2026 / 2027","2027 / 2028","2028 / 2029","2029 / 2030","2030 / 2031","2031 / 2032","2032 / 2033",{"$f":"+AE9","v":"2039 / 2040"},"2040 / 2041"]
[null,null,null,"explain how this has been derived. E.g. are they backed by quotes?","who produced the estimate? select from the list","how old is this data? select from the list",null,"£",{"$f":"+H10","v":"£"},{"$f":"+I10","v":"£"},"£","£","£","£","£","£","£","£","£","£","£","£","£","£",{"$f":"+X10","v":"£"},{"$f":"+Y10","v":"£"},{"$f":"+Z10","v":"£"},{"$f":"+AA10","v":"£"},{"$f":"+AB10","v":"£"},{"$f":"+AC10","v":"£"},{"$f":"+AD10","v":"£"},"£",null,null,null,null,null,null,null,null,{"$f":"+H10","v":"£"},{"$f":"+AO10","v":"£"},{"$f":"+AP10","v":"£"},"£","£","£","£","£","£","£","£","£","£","£","£","£","£","£","£"]
{"$rows_left_out":190}
{"sheet":"Risk Retained","index":5,"n_rows":18,"n_cols":4,"rows_kept":18,"cut":false,"hidden":false,"merged":[]}
[{"$f":"+Summary!$B$8","v":"Project name as it appears on your main business case/expression of interest form:"}]
["Retained risk"]
[]
["Description of risk","Financial impact if it does occur","Liklihood of occuring","Quantified Risk"]
["describe the risk - (eg need for a public enquiry)","how much would it cost if that happened","what is the %age chance that might happen"]
[null,null,null,{"$f":"+C6*B6","v":0}]
[null,null,null,{"$f":"+C7*B7","v":0}]
[null,null,null,0]
[null,null,null,0]
[null,null,null,0]
{"$rows_left_out":9}
{"sheet":"Outputs","index":6,"n_rows":132,"n_cols":58,"rows_kept":132,"cut":false,"hidden":false,"merged":[[111,0,123,0],[8,28,15,28],[3,2,3,5],[3,36,3,39],[26,0,35,0],[21,28,23,28]]}
[null,{"$f":"+Summary!$B$8","v":"Project name as it appears on your main business case/expression of interest form:"},null,null,null,null,null,null,null,null,null,null,null,null,null,null,null,null,null,null,null,null,null,null,null,null,null,null,null,null,null,null,null,null,null,null,"Inflation assumed"]
[null,"outputs",null,null,null,null,null,null,null,null,null,null,null,null,null,null,null,null,null,null,null,null,null,null,null,null,null,null,null,null,null,null,null,null,null,null,null,null,null,null,0,2.5000000000000001E-2,2.5000000000000001E-2,2.5000000000000001E-2,2.5000000000000001E-2,2.5000000000000001E-2,2.5000000000000001E-2,2.5000000000000001E-2,2.5000000000000001E-2,2.5000000000000001E-2,2.5000000000000001E-2,2.5000000000000001E-2,2.5000000000000001E-2,2.5000000000000001E-2,2.5000000000000001E-2]
[null,null,null,null,null,null,null,null,null,null,null,null,null,null,null,null,null,null,null,null,null,null,null,null,null,null,null,null,null,null,null,null,null,null,null,null,null,null,null,null,{"$f":"+(1+AO2)*(1+AN3)-1","v":0},{"$f":"+(1+AP2)*(1+AO3)-1","v":2.4999999999999911E-2},5.062499999999992E-2,7.6890624999999879E-2,0.10381289062499977,0.13140821289062465,0.15969341821289018,0.18868575366821227,0.21840289750991748,0.24886296994766521,0.28008454419635664,0.31208665780126554,0.34488882424629708,0.37851104485245446,0.41297382097376567]
[null,null,{"$f":"+G5","v":"2020 / 2021"},null,null,null,null,null,null,null,null,null,null,null,null,null,null,null,null,null,null,null,null,null,null,null,null,null,"Notes (where appropriate)",null,"Each","Year","GDP","Each","Source",null,{"$f":"+AO5","v":"2020 / 2021"}]
[null,null,{"$f":"+'Project Costs'!H9","v":"Qtr 1"},{"$f":"+'Project Costs'!I9","v":"Qtr 2"},{"$f":"+'Project Costs'!J9","v":"Qtr 3"},{"$f":"+'Project Costs'!K9","v":"Qtr 4"},{"$f":"+'Project Costs'!L9","v":"2020 / 2021"},{"$f":"+'Project Costs'!M9","v":"2021 / 2022"},{"$f":"+'Project Costs'!N9","v":"2022 / 2023"},{"$f":"+'Project Costs'!O9","v":"2023 / 2024"},{"$f":"+'Project Costs'!P9","v":"2024 / 2025"},{"$f":"+'Project Costs'!Q9","v":"2025 / 2026"},{"$f":"+'Project Costs'!R9","v":"2026 / 2027"},{"$f":"+'Project Costs'!S9","v":"2027 / 2028"},{"$f":"+'Project Costs'!T9","v":"2028 / 2029"},{"$f":"+'Project Costs'!U9","v":"2029 / 2030"},{"$f":"+'Project Costs'!V9","v":"2030 / 2031"},{"$f":"+'Project Costs'!W9","v":"2031 / 2032"},{"$f":"+'Project Costs'!X9","v":"2032 / 2033"},{"$f":"+'Project Costs'!Y9","v":"2033 / 2034"},{"$f":"+'Project Costs'!Z9","v":"2034 / 2035"},{"$f":"+'Project Costs'!AA9","v":"2035 / 2036"},{"$f":"+'Project Costs'!AB9","v":"2036 / 2037"},{"$f":"+'Project Costs'!AC9","v":"2037 / 2038"},{"$f":"+'Project Costs'!AD9","v":"2038 / 2039"},{"$f":"+'Project Costs'!AE9","v":"2039 / 2040"},{"$f":"+'Project Costs'!AF9","v":"2040 / 2041"},"Total",null,null,null,null,null,"19/20",null,null,{"$f":"+C5","v":"Qtr 1"},"Qtr 2","Qtr 3","Qtr 4","2020 / 2021","2021 / 2022","2022 / 2023","2023 / 2024","2024 / 2025","2025 / 2026","2026 / 2027","2027 / 2028","2028 / 2029","2029 / 2030","2030 / 2031","2031 / 2032",{"$f":"+Y5","v":"2038 / 2039"},"2039 / 2040","2040 / 2041","Total"]
[null,null,null,null,null,null,null,null,null,null,null,null,null,null,null,null,null,null,null,null,null,null,null,null,null,null,null,null,null,null,"can include your own…","select from list","automatic calculation","automatic calculation","… but must be sourced"]
[]
[null,"Jobs"]
[null,"Jobs Created",null,null,null,null,null,null,null,null,null,null,null,null,null,null,null,null,null,null,null,null,null,null,null,null,null,null,"The total number of newly created and safeguarded permanent full-time equivalent jobs as a direct result of the intervention at predetermined employment sites. Employment sites include occupied newly developed commercial premises, the premises of supported enterprises, and any FE space directly improved or constructed by the intervention. Created and safeguarded jobs exclude those created solely to deliver the intervention (e.g. construction). A job is deemed as permanent if it lasts at least a year."]
[null,"lasting 3 or more years",null,null,null,null,0,null,null,null,null,null,null,null,null,null,null,null,null,null,null,null,null,null,null,null,null,{"$f":"+SUM(G10:AA10)","v":0},null,null,{"$f":"VLOOKUP(Summary!B11,'Land values'!A33:B35,2,0)","v":47182.8},"2018-19",{"$f":"+VLOOKUP(AF10,'GDP Deflators'!$B$8:$C$77,2,0)/'GDP Deflators'!$C$72","v":0.96053025986743512},{"$f":"+AE10/AG10","v":49121.617476696469},"ONS (2018) Sub regional Productivity: Labour Productivity (GVA per hour worked and GVA per filled job) indices by UK NUTS2 and NUTS3 sub regions","economic benefit from a workless claimant entering work",{"$f":"+$AH10*(1+$AO$3)*C10","v":0},{"$f":"+$AH10*(1+$AO$3)*D10","v":0},{"$f":"+$AH10*(1+$AO$3)*E10","v":0},{"$f":"+$AH10*(1+$AO$3)*F10","v":0},{"$f":"+SUM(AK10:AN10)","v":0},{"$f":"+$AH10*(1+AP$3)*H10","v":0},{"$f":"+$AH10*(1+AQ$3)*I10","v":0},{"$f":"+$AH10*(1+AR$3)*J10","v":0},{"$f":"+$AH10*(1+AS$3)*K10","v":0},{"$f":"+$AH10*(1+AT$3)*L10","v":0},{"$f":"+$AH10*(1+AU$3)*M10","v":0},{"$f":"+$AH10*(1+AV$3)*N10","v":0},{"$f":"+$AH10*(1+AW$3)*O10","v":0},{"$f":"+$AH10*(1+AX$3)*P10","v":0},{"$f":"+$AH10*(1+AY$3)*Q10","v":0},{"$f":"+$AH10*(1+AZ$3)*R10","v":0},{"$f":"+$AH10*(1+BA$3)*Y10","v":0},{"$f":"+$AH10*(1+BB$3)*Z10","v":0},{"$f":"+$AH10*(1+BC$3)*AA10","v":0},{"$f":"+SUM(AO10:BC10)","v":0},null,{"$f":"+NPV(6.075%,AP10:BC10)+AO10","v":0}]
{"$rows_left_out":123}
{"sheet":"Risk Register","index":7,"n_rows":60,"n_cols":17,"rows_kept":60,"cut":false,"hidden":false,"merged":[[43,2,43,4],[44,2,44,4],[41,0,56,0],[38,2,38,4],[39,2,39,4],[40,2,40,4],[41,2,41,4],[42,2,42,4],[8,6,8,7],[0,12,0,13],[1,6,1,9],[4,2,4,13],[5,0,5,5],[5,6,5,9],[5,10,5,13],[51,2,51,4],[52,2,52,4],[53,2,53,4],[54,2,54,4],[57,0,59,0],[55,2,55,4],[56,2,56,4],[57,2,57,4],[58,2,58,4],[59,2,59,4],[45,2,45,4],[46,2,46,4],[47,2,47,4],[48,2,48,4],[50,2,50,4],[49,2,49,4]]}
[null,null,null,null,null,null,null,null,null,null,null,null,"Action Status (RAG)",null,null,null,"Action Status (RAG)"]
[null,null,null,null,null,null,"Risk Register",null,null,null,null,null,"R","No plans/not started or actions not working. Still at Significant Risk"]
[null,null,null,null,null,null,null,null,null,null,null,null,"A","Plans behind schedule. Still at Some Risk"]
[null,null,null,null,null,null,null,null,null,null,null,null,"G","Plans on track. Risk being controlled"]
[null,null,null,null,null,null,null,null,null,null,null,null,null,null,null,1,2]
[null,null,null,null,null,null,{"$f":"Summary!B8","v":"Project name as it appears on your main business case/expression of interest form:"},null,null,null,null,null,null,null,null,null,1]
[]
["Risk Ref No.","5 Case Guidance cat.","Risk Description","Risk Owner","Date Identified","Date Last Review","Impact (I)","Likelihood ","Risk Score (I x L)","Existing Controls","Additional Treatment Actions","Date Action Due","Action Status (R, A or G)","Action Owner","Comments"]
[null,"choose from list - see below for explanations of each category","There are three parts (a,b,c) to naming a risk - a) Failure of…, lack of…, development of… b) Leads to… c) Resulting in…",null,null,null,"choose from list - see below for explanations of each category",null,"calculates & colours automatically","The likelihood and impact of the risks need to be considered after the existing internal controls have been evaluated as to their effectiveness.","These are actions which are planned for the future and once implemented these will become part of the \"existing controls.\"",null,"enter R, A or G","The Action Owner is nominated by the Risk Owner and is responsible for the on-going and progress reporting of the action."]
[null,"Availability and performance risk",null,null,null,null,"Insignificant","Rare",{"$f":"VLOOKUP($G10,$G$41:$H$45,2,FALSE)*VLOOKUP($H10,$G$47:$H$51,2,FALSE)","v":1},null,null,null,"G"]
{"$rows_left_out":51}
{"sheet":"Land values","index":8,"n_rows":35,"n_cols":6,"rows_kept":35,"cut":false,"hidden":false,"merged":[]}
[null,"https://www.gov.uk/government/publications/land-value-estimates-for-policy-appraisal-2017"]
[null,"Post permission residential site","agricultural land","industrial land","City centre office space","out of town office space"]
["East Riding",1945000,26000,440000,865000,440000]
["Hull",740000,26000,440000,865000,440000]
[{"$f":"+A3&\" and \"&A4","v":"East Riding and Hull"},null,26000,440000,865000,440000]
[]
[]
[]
[]
[]
{"$rows_left_out":26}
{"sheet":"GDP Deflators","index":9,"n_rows":99,"n_cols":11,"rows_kept":99,"cut":false,"hidden":true,"merged":[[97,2,97,10],[98,2,98,10],[91,2,91,10],[92,2,92,10],[93,2,93,10],[94,2,94,10],[95,2,95,10],[96,2,96,10],[89,2,89,10],[78,2,78,10],[79,2,79,10],[80,2,80,10],[81,2,81,10],[82,2,82,10],[83,2,83,10],[84,2,84,10],[85,2,85,10],[86,2,86,10],[87,2,87,10],[88,2,88,10],[2,1,2,10],[3,1,3,10],[4,1,4,5],[4,7,4,10],[5,2,5,3],[5,8,5,9]]}
[null,"GDP DEFLATORS AT MARKET PRICES, AND MONEY GDP"]
[]
[null,"Outturn data are as at the Quarterly National Accounts from ONS - last updated 29 March 2018."]
[null,"Forecast data are consistent with OBR Spring Statement EFO data as at 13 March 2018"]
[null,"Financial year",null,null,null,null,null,"Calendar year"]
[null,null,"GDP deflator at market prices ",null,"Money GDP (3), (4)",null,null,null,"GDP deflator at market prices ",null,"Money GDP (3)"]
[null,"Financial year","2016-17 = 100","per cent change on previous year","Cash £ million\nNon-Season-ally Adjusted","Cash £ million\nSeasonally Adjusted",null,"Calendar year","2017 = 100","per cent change on previous year","Cash £ million\nNon-Seasonally Adjusted"]
[null,"1955-56",4.0268750000000004,null,19558,19573,null,"1955",3.9883000000000002,null,19154]
[null,"1956-57",4.2794999999999996,6.2734750892441209,21145,21120,null,"1956",4.2648999999999999,6.935285710703802,20827]
[null,"1957-58",4.4764500000000007,4.602173151069076,22497,22512,null,"1957",4.4356,4.0024385096954225,22090]
{"$rows_left_out":90}
{"sheet":"B3","index":10,"n_rows":246,"n_cols":20,"rows_kept":246,"cut":false,"hidden":true,"merged":[]}
["Table B3: Nominal (smoothed) GVA (B) per filled job (£); NUTS 2 and NUTS 3 subregions,  2002 - 2018"]
["Including NUTS 1, England and UK figures for comparison purposes"]
[]
[null,null,null,2002,2003,2004,2005,2006,2007,2008,2009,2010,2011,2012,2013,2014,2015,2016,2017,2018]
["NUTS level","NUTS code","Region name","£","£","£","£","£","£","£","£","£","£","£","£","£","£","£","£","£"]
["UK","UK","United Kingdom less Extra-Regio",36220.35,37970.949999999997,39437.33,41277.31,43217.03,45024.959999999999,45870.66,45894.73,46758.97,47696.63,48879.39,50289.65,51414.64,52315.66,53787.63,55346.84,56386.75]
["Other","E","England",36967.040000000001,38753.4,40248.519999999997,42141.120000000003,44132.86,45983.83,46831.57,46818.75,47657.56,48551.14,49705.74,51107.13,52254.95,53179.57,54674.15,56244.02,57289.65]
["NUTS1","UKC","North East",31800.44,33345.03,34624.22,35989.660000000003,37369.29,38571.730000000003,39190.769999999997,39281.21,40254.379999999997,41220.04,42274.42,43316.82,44204.04,44886.86,46085.45,47200.639999999999,47925.68]
["NUTS2","UKC1","Tees Valley and Durham",31825.53,33408.699999999997,34707.18,36067.269999999997,37447.82,38876.92,39910.410000000003,40374.129999999997,41438.89,42223.39,43026.39,43884.92,44713.49,45436.959999999999,46708.14,47885.22,48618.02]
["NUTS3","UKC11","Hartlepool and Stockton-on-Tees",34988.519999999997,36780.9,38291.629999999997,40072.22,42086.45,44287,45842.14,46331.88,47229.68,47647.73,48182.16,48909.54,49888.62,50800.5,52246.32,53330.5,53926.34]
{"$rows_left_out":236}